{"text_format":"1","workbook":"xlsx","n_sheets":4,"sheets":["TABLAS  INIFED","DATOS Y PRESENTACION","TABLAS TOPOGRAFIA","REGISTROS"],"not_rendered":{"charts":0,"images":2,"macros":1,"external_links":1,"defined_names":0,"comments":0,"pivot_tables":0},"unopened":[],"bounds":{"document_bytes":16777216,"sheet_cells":100000,"rows_first":2000,"rows_last":500,"rows_between":2000,"halvings":0,"cell_chars":16384,"cell_head_chars":4096},"cells_cut":0,"cells_raw":0,"read":"whole","date_system":"1900"}

{"sheet":"TABLAS  INIFED","index":0,"n_rows":1609,"n_cols":16,"rows_kept":1609,"cut":false,"hidden":false,"merged":[[836,1,836,2],[850,1,850,2],[626,1,626,2],[640,1,640,2],[687,1,687,2],[702,1,702,2],[766,1,766,2],[782,1,782,2],[569,1,569,2],[274,1,274,2],[392,1,392,2],[412,1,412,2],[467,1,467,2],[485,1,485,2],[553,1,553,2]]}
["1.1. COSTOS PARAMÉTRICOS DE CONSTRUCCIÓN."]
[]
[]
["Tabla 1.1.A. Análisis de costos de infraestructura física educativa por nivel y modalidad.",null,0.2742]
[null,null,"2020-06-01","2013-12-01","FACTOR INTERCIUDAD"]
["NIVEL EDUCATIVO","MODALIDAD","COSTO / M2",null,{"$f":"+'DATOS Y PRESENTACION'!D24","v":0.96970000000000001}]
[]
["BÁSICO","BASICO Preescolar",{"$f":"+D8*($C$4+1)*$E$6","v":7104.652505},5750]
[null,"BASICO Primaria",{"$f":"+D9*($C$4+1)*$E$6","v":8278.464657999999},6700]
[null,"BASICO Telesecundaria",{"$f":"+D10*($C$4+1)*$E$6","v":6919.313744},5600]
[null,"BASICO Secundaria General",8896.2605280000007,7200]
[null,"BASICO Secundaria Técnica",8896.2605280000007,7200]
[null,null,0]
["MEDIO SUPERIOR","MEDIO SUPERIOR Bachillerato General",8927.1503214999993,7225]
[null,"MEDIO SUPERIOR CBTA",10459.2840791,8465]
[null,"MEDIO SUPERIOR CBTIS",10459.2840791,8465]
[null,"MEDIO SUPERIRO CETIS",8581.1846342999997,6945]
[null,"MEDIO SUPERIOR CET del Mar",10033.004928800001,8120]
[null,"MEDIO SUPERIOR CONALEP",9945.2779152599996,8049]
[null,null,0]
["SUPERIOR","SUPERIOR Institutos Tecnológicos.",14827.10088,12000]
[null,"SUPERIOR Universidades Tecnológicas.",14827.10088,12000]
[null,"SUPERIOR Universidades Politécnicas.",14827.10088,12000]
[null,null,0]
["EDUCACIÓN EXTRAESCOLAR Y DE CAPACITACION","EXTRAESCOLAR Y CAPACITACION Centro de Desarrollo Infantil.",9168.090710800001,7420]
[null,"EXTRAESCOLAR Y CAPACITACION Audición y Lenguaje.",8426.7356667999993,6820]
[null,"EXTRAESCOLAR Y CAPACITACION Deficientes Mentales.",8105.4818144000001,6560]
[null,"EXTRAESCOLAR Y CAPACITACION Audición y Deficientes Mentales.",8425.5000750599993,6819]
[null,"EXTRAESCOLAR Y CAPACITACION Centro Psicopedagógico.",8988.9299085000002,7275]
[null,"EXTRAESCOLAR Y CAPACITACION Capacitación para el Trabajo de Educacion especial",7648.3128705999998,6190]
[null,"ESTRAESCOLAR Y CAPACITACION Centro Múltiple Único.",9168.090710800001,7420]
[null,"EXTRAESCOLAR Y CAPACITACION Centro de Estimulación Temprana.",9563.4800676000013,7740]
[null,"EXTRAESCOLAR Y CAPACITACION Centro de Capacitación para el Trabajo.",7648.3128705999998,6190]
[]
["1.2. FACTORES DE SUPERFICIE."]
["El monto de la remuneración por servicios profesionales disminuye a razón de la mayor dimensión de",null,{"$f":"+G37","v":0}]
["superficie proyectada.","FACTOR DE SUPERFICIE",{"$f":"VLOOKUP(C36,B41:C87,2,FALSE)","v":{"$error":"#N/A"}},{"$f":"+'DATOS Y PRESENTACION'!D16","v":0},"M2 DE CONSTRUCCION",null,{"$f":"IF(D45=0,_xlfn.CEILING.MATH($D$37,100),IF(D45=1,_xlfn.CEILING.MATH($D$37,200),IF(D45=2,_xlfn.CEILING.MATH($D$37,1000),IF(D45=3,_xlfn.CEILING.MATH($D$37,2000),IF(D45=4,_xlfn.CEILING.MATH($D$37,5000),IF(D45=5,_xlfn.CEILING.MATH($D$37,10000),\" \"))))))","v":0}]
[]
["RANGOS DE SUPERFICIE M2",null,"FACTOR DE SUPERFICIE",{"$f":"+IF(D37>400,1,\" \")","v":" "}]
[null,null,null,{"$f":"+IF(D37>4000,1,\" \")","v":" "}]
{"$rows_left_out":1570}
{"sheet":"DATOS Y PRESENTACION","index":1,"n_rows":513,"n_cols":10,"rows_kept":513,"cut":false,"hidden":false,"merged":[[77,2,77,5],[87,2,87,5],[4,2,4,5],[2,2,2,5],[59,2,59,5],[42,2,42,5],[48,2,48,5],[68,2,68,5]]}
[]
[]
[null,null,"ARANCELES PROFESIONALES DE HONORARIOS POR INTEGRACION DE DICTAMENES Y FUNCION PERICIAL PARA EL INIFEG EN EL ESTADO DE GUANAJUATO"]
[]
[null,null,"ANALISIS DE VERIFICACION NORMATIVA INIFED"]
[]
[null,null,"NOMBRE DE LA ESCUELA"]
[null,null,"UBICACIÓN"]
[null,null,"PROPIETARIO"]
[null,null,"NIVEL"]
[null,null,"MODALIDAD"]
[null,null,"GRUPOS"]
[null,null,"TIPO DE TRAMITE"]
[]
[null,null,"SUPERFICIE DE TERRENO",null,{"$f":"+IF(D15=\"\",\" \",\"M2\")","v":" "}]
[null,null,"SUPERFICIE DE AREA CONSTRUIDA",null,{"$f":"+IF(D16=\"\",\" \",\"M2\")","v":" "}]
[null,null,"SUPERFICIE DE PROYECTO DE GUIA MECANICA",null," "]
[]
[null,null,"COSTO POR M2 SEGÚN GENERO DE EDIFICIO",{"$f":"IF(D16=\"\",\" \",VLOOKUP(D11,'TABLAS  INIFED'!B6:C34,2,FALSE))","v":" "}]
[null,null,"COSTO ESTIMADO DE LA OBRA",{"$f":"IF(D16=\"\",\" \",+D19*D16)","v":" "}]
[null,null,"COSTO ESTIMADO DEL PROYECTO EJECUTIVO",{"$f":"+IF(D16=\"\",\" \",+D211)","v":" "},{"$f":"+D21/D20","v":{"$error":"#VALUE!"}}]
[null,null,"LOCALIZACION DEL INMUEBLE (CIUDAD)"]
[null,null,"FACTOR PARA PROYECTOS FORANEOS POR (CIUDAD)",{"$f":"+IF(D16=\"\",\" \",VLOOKUP(D22,'TABLAS  INIFED'!A151:C200,3,FALSE))","v":" "}]
[null,null,"FACTOR INTERCIUDAD PARAMETRICOS (ZONA BAJIO)",0.96970000000000001]
[null,null,"FACTOR DE SUPERFICIE",{"$f":"+IF(D16=\"\",\" \",'TABLAS  INIFED'!C37)","v":" "}]
[null,null,"FACTOR DE ALCANCE",1]
[]
[null,null,"SALARIO MINIMO",123.22]
[]
[null,null,"CLASIFICACION DE LA ESTRUCTURA DE MANERA SUPLETORIA SEGÚN LAS NORMAS TECNICAS PARA LA CIUDAD DE MEXICO",null,{"$f":"VLOOKUP(D30,'TABLAS  INIFED'!B382:C385,2,FALSE)","v":{"$error":"#N/A"}}]
[null,null,"Tipo A :Son aquellas clasificadas como ligeras o medianas, de poca extensión y con excavaciones"]
[null,null,"Tipo A.1 :Son aquellas estructuras del tipo A que no satisfacen las Condiciones de Regularidad de las"]
[null,null,"Tipo B :Son aquellas clasificadas como pesadas, extensas o con excavaciones profundas."]
[null,null,"Tipo B.1 :Son aquellas estructuras del tipo B que no satisfacen las Condiciones de Regularidad de las"]
[null,null,"CLASIFICACION DE INSTALACION DE AIRES ACONDICIONADOS",null,{"$f":"IF(D35=\"\",\" \",VLOOKUP(D35,H36:I38,2,FALSE))","v":" "}]
[null,null,"Tipo A :  Sistemas que proporcionan únicamente ventilación mecánica para inyección y/o extracción.",null,null,null,null,"Tipo A:",1]
[null,null,"Tipo B :  Sistemas que proporcionan enfriamiento de aire para climas templados o durante el verano.",null,null,null,null,"Tipo B:",1.33]
[null,null,"Tipo C : Sistemas que requieren de refrigeración y/o calefacción, humidificación y filtración y que contarán con un balance térmico.",null,null,null,null,"Tipo C:",4]
[]
[null,null,"DURACION DE LA OBRA EN DIAS"]
{"$rows_left_out":474}
{"sheet":"TABLAS TOPOGRAFIA","index":2,"n_rows":2394,"n_cols":15,"rows_kept":2394,"cut":false,"hidden":true,"merged":[]}
[]
[null,"LEVANTAMIENTO TOPOGRAFICO ",null,null,null,null,null,null,"LEVANTAMIENTO CONSTRUCCION",null,null,null,"LEVANTAMIENTO INSTALACIONES"]
[null,"PLANIMETRIA",null,null,null,null,null,null,"M2",null,null,null,"M2"]
[]
[null,"MEMORIA DE CALCULO",null,null,null,{"$f":"+IF('[1]DATOS Y PRESENTACION'!D22=\"\",\" \",'[1]DATOS Y PRESENTACION'!D22)","v":" "}]
[null,"CUADRO DE CONSTRUCCION",null,null,null,"FACTOR 1",{"$f":"+IF(F5=\"IRREGULAR\",1.05,1)","v":1}]
[null,"PLANO",null,null,null,{"$f":"+IF('[1]DATOS Y PRESENTACION'!D24=\"\",\" \",'[1]DATOS Y PRESENTACION'!D24)","v":" "},null,null,"PLANO",null,null,null,"PLANO"]
[null,null,null,null,null,"FACTOR 2",{"$f":"+IF(F7=\"PENDIENTE LIGERA REGULAR\",1.03,IF(F7=\"PENDIENTE LIGERA IRREGULAR\",1.06,IF(F7=\"PENDIENTE FUERTE REGULAR\",1.09,IF(F7=\"PENDIENTE FUERTE IRREGULAR\",1.12,1))))","v":1}]
[null,"SUPERFICIE EN M2",null,{"$f":"IF($E$9=0,0,IF($E$9<200,200,IF($E$9<10000,CEILING($E$9,100),CEILING($E$9,10000))))","v":{"$error":"#VALUE!"}},{"$f":"+IF('DATOS Y PRESENTACION'!D61=\"\",0,'DATOS Y PRESENTACION'!D61)","v":" "},"CON FACTORES",null,null,"SUPERFICIE EN M2",{"$f":"CEILING(K9,100)","v":{"$error":"#VALUE!"}},{"$f":"+'[1]DATOS Y PRESENTACION'!I28","v":" "},null,"SUPERFICIE EN M2",{"$f":"+IF(O9=0,0,IF(O9<70,70,O9))","v":" "},{"$f":"+'[1]DATOS Y PRESENTACION'!I28","v":" "}]
[null,"SUPERFICIE EN HECTAREAS",null,{"$f":"+D9/10000","v":{"$error":"#VALUE!"}},{"$f":"+VLOOKUP(D10,B13:E300,4,FALSE)","v":{"$error":"#VALUE!"}},null,{"$f":"+E10*G8*G6","v":{"$error":"#VALUE!"}}]
[null,"HAS",null,null,null,null,"costo por m2"]
["m2","SUPERFICIE","COSTO POR HECTAREA",null,"IMPORTE","AUMENTO","AUMENTO",null,"SUPERFICIE","COSTO POR M2","IMPORTE",null,"SUPERFICIE","COSTO POR M2","IMPORTE"]
[0,0,null,null,0]
[150,{"$f":"+A14/10000","v":1.4999999999999999E-2},{"$f":"+E14/B14","v":66666.666666666672},null,1000,null,null,null,0,15,0,null,0,10,0]
[200,{"$f":"+A15/10000","v":0.02},{"$f":"+E15/B15","v":75000},null,{"$f":"+E14+F15","v":1500},500,{"$f":"+F15/100","v":5},null,70,15,{"$f":"+J15*I15","v":1050},null,70,15,{"$f":"+N15*M15","v":1050}]
[300,0.03,{"$f":"+E16/B16","v":66666.666666666672},null,2000,{"$f":"+F15","v":500},{"$f":"+F16/100","v":5},null,71,15,1065,null,71,15,1065]
[400,0.04,62500,null,2500,{"$f":"+F16","v":500},5,null,72,15,1080,null,72,15,1080]
[500,0.05,60000,null,3000,{"$f":"+F17","v":500},5,null,73,15,1095,null,73,15,1095]
[600,0.06,56666.666666666672,null,3400,{"$f":"+F18*0.8","v":400},4,null,74,15,1110,null,74,15,1110]
[700,7.0000000000000007E-2,54285.714285714283,null,3800,{"$f":"+F19","v":400},4,null,75,15,1125,null,75,15,1125]
[800,0.08,52500,null,4200,{"$f":"+F20","v":400},4,null,76,15,1140,null,76,15,1140]
[900,0.09,51111.111111111109,null,4600,{"$f":"+F21","v":400},4,null,77,15,1155,null,77,15,1155]
[1000,0.1,50000,null,5000,{"$f":"+F22","v":400},4,null,78,15,1170,null,78,15,1170]
[1100,0.11,46590.909090909088,null,5125,{"$f":"+F23*0.3125","v":125},1.25,null,79,15,1185,null,79,15,1185]
[1200,0.12,43750,null,5250,{"$f":"+F24","v":125},1.25,null,80,15,1200,null,80,15,1200]
[1300,0.13,41346.153846153844,null,5375,{"$f":"+F25","v":125},1.25,null,81,15,1215,null,81,15,1215]
[1400,0.14000000000000001,39285.714285714283,null,5500,125,1.25,null,82,15,1230,null,82,15,1230]
[1500,0.15,37500,null,5625,125,1.25,null,83,15,1245,null,83,15,1245]
[1600,0.16,35937.5,null,5750,125,1.25,null,84,15,1260,null,84,15,1260]
[1700,0.17,34558.823529411762,null,5875,125,1.25,null,85,15,1275,null,85,15,1275]
[1800,0.18,33333.333333333336,null,6000,125,{"$f":"+F31/100","v":1.25},null,86,15,1290,null,86,15,1290]
[1900,0.19,32236.842105263157,null,6125,125,1.25,null,87,15,1305,null,87,15,1305]
[2000,0.2,31250,null,6250,125,1.25,null,88,15,1320,null,88,15,1320]
[2100,0.21,30000,null,6300,{"$f":"+F33*0.4","v":50},0.5,null,89,15,1335,null,89,15,1335]
[2200,0.22,28863.636363636364,null,6350,{"$f":"+F34","v":50},0.5,null,90,15,1350,null,90,15,1350]
[2300,0.23,27826.086956521736,null,6400,{"$f":"+F35","v":50},0.5,null,91,15,1365,null,91,15,1365]
[2400,0.24,26875,null,6450,50,0.5,null,92,15,1380,null,92,15,1380]
[2500,0.25,26000,null,6500,50,0.5,null,93,15,1395,null,93,15,1395]
[2600,0.26,25192.307692307691,null,6550,50,0.5,null,94,15,1410,null,94,15,1410]
[2700,0.27,24444.444444444442,null,6600,50,0.5,null,95,15,1425,null,95,15,1425]
{"$rows_left_out":2355}
{"sheet":"REGISTROS","index":3,"n_rows":10,"n_cols":241,"rows_kept":10,"cut":false,"hidden":true,"merged":[]}
["COTIZACION","FECHA",null,"PROPIETARIO:",null,"UBICACIÓN DE LA OBRA:",null,"TRABAJOS A REALIZAR",null,null,null,"SUPERFICIE DEL TERRENO  EN M2",null,"DENSIDAD HABITACIONAL",null,null,"FORMA TERRENO",null,"TOPOGRAFIA PLANA O CON PENDIENTE",null,"PROXIMIDAD URBANA",null,"SUPERFICIE CONSTRUIDA EN M2",null,"BARDEO   ANOTAR METROS LINEALES Y ALTURA",null,"SUPERFICIE A CONSTRUIR EN M2","CLASIFICACION DE LA OBRA POR GENERO",null,"SALARIO MINIMO DIARIO DE LA REGION","COSTO BASE POR METRO CUADRADO DE CONSTRUCCION","FACTOR REGIONAL",null,"NUMERO DE SEMANAS DE EJECUCION DE OBRA",null,"NUMERO DE VISITAS SEMANAL A LA OBRA",null,"COSTO APROXIMADO TOTAL DE OBRA",null,"AJUSTE",null,"HONORARIOS POR DISEÑO ARQUITECTONICO ","LEVANTAMIENTO TOPOGRAFICO TERRENO (PLANIMETRIA)","LEVANTAMIENTO TOPOGRAFICO TERRENO (CURVAS DE NIVEL)","LEVANTAMIENTO GEOREFERENCIADO","LEVANTAMIENTO TOPOGRAFICO CONSTRUCCION","LEVANTAMIENTO TOPOGRAFICO INSTALACIONES","TRAMITE DE CLAVE CATASTRAL","TRAMITE DE NUMERO OFICIAL","TRAMITE DE ALINEAMIENTO","FACTIBILIDAD DE USO DE SUELO","TRAMITE BOMBEROS REVISION PROYECTO","TRAMITE PROTECCION CIVIL ","TRAMITE DE AUTORIZACION MUNICIPAL DE IMPACTO AMBIENTAL","TRAMITE  DE MANIFESTACION DE  IMPACTO AMBIENTAL","USO : ","MODALIDAD : ","UBICACIÓN  :  ","TRAMITE DE  POLICIA VIAL (MOVILIDAD, IMPACTO VIAL)","FACTIBILIDAD CFE","FACTIBILIDAD JAPAMI","TRAMITE USO DE SUELO","REGULARIZACION (ANTES INCORPORACION URBANISTICA)",null,"PROYECTO DE DIVISION O FUSION  INDICAR No. DE FRACCIONES","PROYECTO DE DIVISION O FUSION EN FRACCIONAMIENTOS O REPETITIVOS","TRAMITE PERMISO BARDEO","HONORARIOS POR DISEÑO URBANO","PERITO ESPECIALIZADO EN ESTRUCTURAS DE ACERO","PERITO ESPECIALIZADO EN ESTRUCTURAS DE CONCRETO","PERITO ESPECIALIZADO EN DISEÑO URBANO","PERITO ESPECIALIZADO ","PERITO ESPECIALIZADO","HONORARIOS POR CONSULTORIA Y RESPONSIVA",null,null,null,null,null,"HONORARIOS POR DISEÑO ARQUITECTONICO ","LEVANTAMIENTO TOPOGRAFICO TERRENO (PLANIMETRIA)","LEVANTAMIENTO TOPOGRAFICO TERRENO (CURVAS DE NIVEL)","LEVANTAMIENTO GEOREFERENCIADO","LEVANTAMIENTO TOPOGRAFICO CONSTRUCCION","LEVANTAMIENTO TOPOGRAFICO INSTALACIONES","TRAMITE DE CLAVE CATASTRAL","TRAMITE DE NUMERO OFICIAL","TRAMITE DE ALINEAMIENTO","FACTIBILIDAD DE USO DE SUELO","TRAMITE BOMBEROS REVISION PROYECTO","TRAMITE PROTECCION CIVIL ","TRAMITE DE AUTORIZACION MUNICIPAL DE IMPACTO AMBIENTAL","TRAMITE  DE MANIFESTACION DE  IMPACTO AMBIENTAL","USO : ","MODALIDAD : ","UBICACIÓN  :  ","TRAMITE DE  POLICIA VIAL (MOVILIDAD, IMPACTO VIAL)","FACTIBILIDAD CFE","FACTIBILIDAD JAPAMI","TRAMITE USO DE SUELO","REGULARIZACION (ANTES INCORPORACION URBANISTICA)","DICTAMEN ESTRUCTURAL","PROYECTO DE DIVISION O FUSION  INDICAR No. DE FRACCIONES","PROYECTO DE DIVISION O FUSION EN FRACCIONAMIENTOS O REPETITIVOS","TRAMITE PERMISO BARDEO","HONORARIOS POR DISEÑO URBANO","PERITO ESPECIALIZADO EN ESTRUCTURAS DE ACERO","PERITO ESPECIALIZADO EN ESTRUCTURAS DE CONCRETO","PERITO ESPECIALIZADO EN DISEÑO URBANO","PERITO ESPECIALIZADO ","PERITO ESPECIALIZADO","HONORARIOS POR CONSULTORIA Y RESPONSIVA",null,"TOTAL HONORARIOS",null,null,"IVA",null,null,"GRAN TOTAL HONORARIOS",null,{"$f":"+IF([1]CONSULTARCOTIZACION!F2=\"\",\" \",[1]CONSULTARCOTIZACION!$F$2)","v":" "},"FECHA",null,"PROPIETARIO:",null,"UBICACIÓN DE LA OBRA:",null,"TRABAJOS A REALIZAR",null,null,null,"SUPERFICIE DEL TERRENO  EN M2",null,"DENSIDAD HABITACIONAL",null,null,"FORMA TERRENO",null,"TOPOGRAFIA PLANA O CON PENDIENTE",null,"PROXIMIDAD URBANA",null,"SUPERFICIE CONSTRUIDA EN M2",null,"BARDEO   ANOTAR METROS LINEALES Y ALTURA",null,"SUPERFICIE A CONSTRUIR EN M2","CLASIFICACION DE LA OBRA POR GENERO",null,"SALARIO MINIMO DIARIO DE LA REGION","COSTO BASE POR METRO CUADRADO DE CONSTRUCCION","FACTOR REGIONAL",null,"NUMERO DE SEMANAS DE EJECUCION DE OBRA",null,"NUMERO DE VISITAS SEMANAL A LA OBRA",null,"COSTO APROXIMADO TOTAL DE OBRA",null,"AJUSTE",null,"HONORARIOS POR DISEÑO ARQUITECTONICO ","LEVANTAMIENTO TOPOGRAFICO TERRENO (PLANIMETRIA)","LEVANTAMIENTO TOPOGRAFICO TERRENO (CURVAS DE NIVEL)","LEVANTAMIENTO GEOREFERENCIADO","LEVANTAMIENTO TOPOGRAFICO CONSTRUCCION","LEVANTAMIENTO TOPOGRAFICO INSTALACIONES","TRAMITE DE CLAVE CATASTRAL","TRAMITE DE NUMERO OFICIAL","TRAMITE DE ALINEAMIENTO","FACTIBILIDAD DE USO DE SUELO","TRAMITE BOMBEROS REVISION PROYECTO","TRAMITE PROTECCION CIVIL ","TRAMITE DE AUTORIZACION MUNICIPAL DE IMPACTO AMBIENTAL","TRAMITE  DE MANIFESTACION DE  IMPACTO AMBIENTAL","USO : ","MODALIDAD : ","UBICACIÓN  :  ","TRAMITE DE  POLICIA VIAL (MOVILIDAD, IMPACTO VIAL)","FACTIBILIDAD CFE","FACTIBILIDAD JAPAMI","TRAMITE USO DE SUELO","REGULARIZACION (ANTES INCORPORACION URBANISTICA)",null,"PROYECTO DE DIVISION O FUSION  INDICAR No. DE FRACCIONES","PROYECTO DE DIVISION O FUSION EN FRACCIONAMIENTOS O REPETITIVOS","TRAMITE PERMISO BARDEO","HONORARIOS POR DISEÑO URBANO","PERITO ESPECIALIZADO EN ESTRUCTURAS DE ACERO","PERITO ESPECIALIZADO EN ESTRUCTURAS DE CONCRETO","PERITO ESPECIALIZADO EN DISEÑO URBANO","PERITO ESPECIALIZADO ","PERITO ESPECIALIZADO","HONORARIOS POR CONSULTORIA Y RESPONSIVA",null,null,null,null,null,"HONORARIOS POR DISEÑO ARQUITECTONICO ","LEVANTAMIENTO TOPOGRAFICO TERRENO (PLANIMETRIA)","LEVANTAMIENTO TOPOGRAFICO TERRENO (CURVAS DE NIVEL)","LEVANTAMIENTO GEOREFERENCIADO","LEVANTAMIENTO TOPOGRAFICO CONSTRUCCION","LEVANTAMIENTO TOPOGRAFICO INSTALACIONES","TRAMITE DE CLAVE CATASTRAL","TRAMITE DE NUMERO OFICIAL","TRAMITE DE ALINEAMIENTO","FACTIBILIDAD DE USO DE SUELO","TRAMITE BOMBEROS REVISION PROYECTO","TRAMITE PROTECCION CIVIL ","TRAMITE DE AUTORIZACION MUNICIPAL DE IMPACTO AMBIENTAL","TRAMITE  DE MANIFESTACION DE  IMPACTO AMBIENTAL","USO : ","MODALIDAD : ","UBICACIÓN  :  ","TRAMITE DE  POLICIA VIAL (MOVILIDAD, IMPACTO VIAL)","FACTIBILIDAD CFE","FACTIBILIDAD JAPAMI","TRAMITE USO DE SUELO","REGULARIZACION (ANTES INCORPORACION URBANISTICA)","DICTAMEN ESTRUCTURAL","PROYECTO DE DIVISION O FUSION  INDICAR No. DE FRACCIONES","PROYECTO DE DIVISION O FUSION EN FRACCIONAMIENTOS O REPETITIVOS","TRAMITE PERMISO BARDEO","HONORARIOS POR DISEÑO URBANO","PERITO ESPECIALIZADO EN ESTRUCTURAS DE ACERO","PERITO ESPECIALIZADO EN ESTRUCTURAS DE CONCRETO","PERITO ESPECIALIZADO EN DISEÑO URBANO","PERITO ESPECIALIZADO ","PERITO ESPECIALIZADO","HONORARIOS POR CONSULTORIA Y RESPONSIVA",null,"TOTAL HONORARIOS",null,null,"IVA",null,null,"GRAN TOTAL HONORARIOS"]
[1,"2018-03-19",null,null,null,null,null,null,null,null,null,null,null,null,null,null,null,null,null,null,null,null,null,null,null,null,null,null,null,88.36,5990,0.88500000000000001,null," ",null,null,null," ",null,0,null,null,null,null,null,null,null," "," "," "," ",null,null,null,"MANIFESTACION DE IMPACTO AMBIENTAL"," "," "," "," ",null,null,null,"RESPONSIVA TECNICA","DICTAMEN ESTRUCTURAL",0,0," ",null,null,null,null,null,null,null,null,null,null,null,null," "," "," "," "," "," "," "," "," "," "," "," "," "," ",null,null,null," "," "," "," "," "," "," "," "," "," ",0,0,0,0,0," ",null,0,null,null,0,null,null,0,null,{"$f":"VLOOKUP($DR$1,$A:$DP,1,FALSE)","v":{"$error":"#N/A"}},{"$f":"VLOOKUP($DR$1,$A:$DP,2,FALSE)","v":{"$error":"#N/A"}},{"$f":"VLOOKUP($DR$1,$A:$DP,3,FALSE)","v":{"$error":"#N/A"}},{"$f":"VLOOKUP($DR$1,$A:$DP,4,FALSE)","v":{"$error":"#N/A"}},{"$f":"VLOOKUP($DR$1,$A:$DP,5,FALSE)","v":{"$error":"#N/A"}},{"$f":"VLOOKUP($DR$1,$A:$DP,6,FALSE)","v":{"$error":"#N/A"}},{"$f":"VLOOKUP($DR$1,$A:$DP,7,FALSE)","v":{"$error":"#N/A"}},{"$f":"VLOOKUP($DR$1,$A:$DP,8,FALSE)","v":{"$error":"#N/A"}},{"$f":"VLOOKUP($DR$1,$A:$DP,9,FALSE)","v":{"$error":"#N/A"}},{"$f":"VLOOKUP($DR$1,$A:$DP,10,FALSE)","v":{"$error":"#N/A"}},{"$f":"VLOOKUP($DR$1,$A:$DP,11,FALSE)","v":{"$error":"#N/A"}},{"$f":"VLOOKUP($DR$1,$A:$DP,12,FALSE)","v":{"$error":"#N/A"}},{"$f":"VLOOKUP($DR$1,$A:$DP,13,FALSE)","v":{"$error":"#N/A"}},{"$f":"VLOOKUP($DR$1,$A:$DP,14,FALSE)","v":{"$error":"#N/A"}},{"$f":"VLOOKUP($DR$1,$A:$DP,15,FALSE)","v":{"$error":"#N/A"}},{"$f":"VLOOKUP($DR$1,$A:$DP,16,FALSE)","v":{"$error":"#N/A"}},{"$f":"VLOOKUP($DR$1,$A:$DP,17,FALSE)","v":{"$error":"#N/A"}},{"$f":"VLOOKUP($DR$1,$A:$DP,18,FALSE)","v":{"$error":"#N/A"}},{"$f":"VLOOKUP($DR$1,$A:$DP,19,FALSE)","v":{"$error":"#N/A"}},{"$f":"VLOOKUP($DR$1,$A:$DP,20,FALSE)","v":{"$error":"#N/A"}},{"$f":"VLOOKUP($DR$1,$A:$DP,21,FALSE)","v":{"$error":"#N/A"}},{"$f":"VLOOKUP($DR$1,$A:$DP,22,FALSE)","v":{"$error":"#N/A"}},{"$f":"VLOOKUP($DR$1,$A:$DP,23,FALSE)","v":{"$error":"#N/A"}},{"$f":"VLOOKUP($DR$1,$A:$DP,24,FALSE)","v":{"$error":"#N/A"}},{"$f":"VLOOKUP($DR$1,$A:$DP,25,FALSE)","v":{"$error":"#N/A"}},{"$f":"VLOOKUP($DR$1,$A:$DP,26,FALSE)","v":{"$error":"#N/A"}},{"$f":"VLOOKUP($DR$1,$A:$DP,27,FALSE)","v":{"$error":"#N/A"}},{"$f":"VLOOKUP($DR$1,$A:$DP,28,FALSE)","v":{"$error":"#N/A"}},{"$f":"VLOOKUP($DR$1,$A:$DP,29,FALSE)","v":{"$error":"#N/A"}},{"$f":"VLOOKUP($DR$1,$A:$DP,30,FALSE)","v":{"$error":"#N/A"}},{"$f":"VLOOKUP($DR$1,$A:$DP,31,FALSE)","v":{"$error":"#N/A"}},{"$f":"VLOOKUP($DR$1,$A:$DP,32,FALSE)","v":{"$error":"#N/A"}},{"$f":"VLOOKUP($DR$1,$A:$DP,33,FALSE)","v":{"$error":"#N/A"}},{"$f":"VLOOKUP($DR$1,$A:$DP,34,FALSE)","v":{"$error":"#N/A"}},{"$f":"VLOOKUP($DR$1,$A:$DP,35,FALSE)","v":{"$error":"#N/A"}},{"$f":"VLOOKUP($DR$1,$A:$DP,36,FALSE)","v":{"$error":"#N/A"}},{"$f":"VLOOKUP($DR$1,$A:$DP,37,FALSE)","v":{"$error":"#N/A"}},{"$f":"VLOOKUP($DR$1,$A:$DP,38,FALSE)","v":{"$error":"#N/A"}},{"$f":"VLOOKUP($DR$1,$A:$DP,39,FALSE)","v":{"$error":"#N/A"}},{"$f":"VLOOKUP($DR$1,$A:$DP,40,FALSE)","v":{"$error":"#N/A"}},{"$f":"VLOOKUP($DR$1,$A:$DP,41,FALSE)","v":{"$error":"#N/A"}},{"$f":"VLOOKUP($DR$1,$A:$DP,42,FALSE)","v":{"$error":"#N/A"}},{"$f":"VLOOKUP($DR$1,$A:$DP,43,FALSE)","v":{"$error":"#N/A"}},{"$f":"VLOOKUP($DR$1,$A:$DP,44,FALSE)","v":{"$error":"#N/A"}},{"$f":"VLOOKUP($DR$1,$A:$DP,45,FALSE)","v":{"$error":"#N/A"}},{"$f":"VLOOKUP($DR$1,$A:$DP,46,FALSE)","v":{"$error":"#N/A"}},{"$f":"VLOOKUP($DR$1,$A:$DP,47,FALSE)","v":{"$error":"#N/A"}},{"$f":"VLOOKUP($DR$1,$A:$DP,48,FALSE)","v":{"$error":"#N/A"}},{"$f":"VLOOKUP($DR$1,$A:$DP,49,FALSE)","v":{"$error":"#N/A"}},{"$f":"VLOOKUP($DR$1,$A:$DP,50,FALSE)","v":{"$error":"#N/A"}},{"$f":"VLOOKUP($DR$1,$A:$DP,51,FALSE)","v":{"$error":"#N/A"}},{"$f":"VLOOKUP($DR$1,$A:$DP,52,FALSE)","v":{"$error":"#N/A"}},{"$f":"VLOOKUP($DR$1,$A:$DP,53,FALSE)","v":{"$error":"#N/A"}},{"$f":"VLOOKUP($DR$1,$A:$DP,54,FALSE)","v":{"$error":"#N/A"}},{"$f":"VLOOKUP($DR$1,$A:$DP,55,FALSE)","v":{"$error":"#N/A"}},{"$f":"VLOOKUP($DR$1,$A:$DP,56,FALSE)","v":{"$error":"#N/A"}},{"$f":"VLOOKUP($DR$1,$A:$DP,57,FALSE)","v":{"$error":"#N/A"}},{"$f":"VLOOKUP($DR$1,$A:$DP,58,FALSE)","v":{"$error":"#N/A"}},{"$f":"VLOOKUP($DR$1,$A:$DP,59,FALSE)","v":{"$error":"#N/A"}},{"$f":"VLOOKUP($DR$1,$A:$DP,60,FALSE)","v":{"$error":"#N/A"}},{"$f":"VLOOKUP($DR$1,$A:$DP,61,FALSE)","v":{"$error":"#N/A"}},{"$f":"VLOOKUP($DR$1,$A:$DP,62,FALSE)","v":{"$error":"#N/A"}},{"$f":"VLOOKUP($DR$1,$A:$DP,63,FALSE)","v":{"$error":"#N/A"}},{"$f":"VLOOKUP($DR$1,$A:$DP,64,FALSE)","v":{"$error":"#N/A"}},{"$f":"VLOOKUP($DR$1,$A:$DP,65,FALSE)","v":{"$error":"#N/A"}},{"$f":"VLOOKUP($DR$1,$A:$DP,66,FALSE)","v":{"$error":"#N/A"}},{"$f":"VLOOKUP($DR$1,$A:$DP,67,FALSE)","v":{"$error":"#N/A"}},{"$f":"VLOOKUP($DR$1,$A:$DP,68,FALSE)","v":{"$error":"#N/A"}},{"$f":"VLOOKUP($DR$1,$A:$DP,69,FALSE)","v":{"$error":"#N/A"}},{"$f":"VLOOKUP($DR$1,$A:$DP,70,FALSE)","v":{"$error":"#N/A"}},{"$f":"VLOOKUP($DR$1,$A:$DP,71,FALSE)","v":{"$error":"#N/A"}},{"$f":"VLOOKUP($DR$1,$A:$DP,72,FALSE)","v":{"$error":"#N/A"}},{"$f":"VLOOKUP($DR$1,$A:$DP,73,FALSE)","v":{"$error":"#N/A"}},{"$f":"VLOOKUP($DR$1,$A:$DP,74,FALSE)","v":{"$error":"#N/A"}},{"$f":"VLOOKUP($DR$1,$A:$DP,75,FALSE)","v":{"$error":"#N/A"}},{"$f":"VLOOKUP($DR$1,$A:$DP,76,FALSE)","v":{"$error":"#N/A"}},{"$f":"VLOOKUP($DR$1,$A:$DP,77,FALSE)","v":{"$error":"#N/A"}},{"$f":"VLOOKUP($DR$1,$A:$DP,78,FALSE)","v":{"$error":"#N/A"}},{"$f":"VLOOKUP($DR$1,$A:$DP,79,FALSE)","v":{"$error":"#N/A"}},{"$f":"VLOOKUP($DR$1,$A:$DP,80,FALSE)","v":{"$error":"#N/A"}},{"$f":"VLOOKUP($DR$1,$A:$DP,81,FALSE)","v":{"$error":"#N/A"}},{"$f":"VLOOKUP($DR$1,$A:$DP,82,FALSE)","v":{"$error":"#N/A"}},{"$f":"VLOOKUP($DR$1,$A:$DP,83,FALSE)","v":{"$error":"#N/A"}},{"$f":"VLOOKUP($DR$1,$A:$DP,84,FALSE)","v":{"$error":"#N/A"}},{"$f":"VLOOKUP($DR$1,$A:$DP,85,FALSE)","v":{"$error":"#N/A"}},{"$f":"VLOOKUP($DR$1,$A:$DP,86,FALSE)","v":{"$error":"#N/A"}},{"$f":"VLOOKUP($DR$1,$A:$DP,87,FALSE)","v":{"$error":"#N/A"}},{"$f":"VLOOKUP($DR$1,$A:$DP,88,FALSE)","v":{"$error":"#N/A"}},{"$f":"VLOOKUP($DR$1,$A:$DP,89,FALSE)","v":{"$error":"#N/A"}},{"$f":"VLOOKUP($DR$1,$A:$DP,90,FALSE)","v":{"$error":"#N/A"}},{"$f":"VLOOKUP($DR$1,$A:$DP,91,FALSE)","v":{"$error":"#N/A"}},{"$f":"VLOOKUP($DR$1,$A:$DP,92,FALSE)","v":{"$error":"#N/A"}},{"$f":"VLOOKUP($DR$1,$A:$DP,93,FALSE)","v":{"$error":"#N/A"}},{"$f":"VLOOKUP($DR$1,$A:$DP,94,FALSE)","v":{"$error":"#N/A"}},{"$f":"VLOOKUP($DR$1,$A:$DP,95,FALSE)","v":{"$error":"#N/A"}},{"$f":"VLOOKUP($DR$1,$A:$DP,96,FALSE)","v":{"$error":"#N/A"}},{"$f":"VLOOKUP($DR$1,$A:$DP,97,FALSE)","v":{"$error":"#N/A"}},{"$f":"VLOOKUP($DR$1,$A:$DP,98,FALSE)","v":{"$error":"#N/A"}},{"$f":"VLOOKUP($DR$1,$A:$DP,99,FALSE)","v":{"$error":"#N/A"}},{"$f":"VLOOKUP($DR$1,$A:$DP,100,FALSE)","v":{"$error":"#N/A"}},{"$f":"VLOOKUP($DR$1,$A:$DP,101,FALSE)","v":{"$error":"#N/A"}},{"$f":"VLOOKUP($DR$1,$A:$DP,102,FALSE)","v":{"$error":"#N/A"}},{"$f":"VLOOKUP($DR$1,$A:$DP,103,FALSE)","v":{"$error":"#N/A"}},{"$f":"VLOOKUP($DR$1,$A:$DP,104,FALSE)","v":{"$error":"#N/A"}},{"$f":"VLOOKUP($DR$1,$A:$DP,105,FALSE)","v":{"$error":"#N/A"}},{"$f":"VLOOKUP($DR$1,$A:$DP,106,FALSE)","v":{"$error":"#N/A"}},{"$f":"VLOOKUP($DR$1,$A:$DP,107,FALSE)","v":{"$error":"#N/A"}},{"$f":"VLOOKUP($DR$1,$A:$DP,108,FALSE)","v":{"$error":"#N/A"}},{"$f":"VLOOKUP($DR$1,$A:$DP,109,FALSE)","v":{"$error":"#N/A"}},{"$f":"VLOOKUP($DR$1,$A:$DP,110,FALSE)","v":{"$error":"#N/A"}},{"$f":"VLOOKUP($DR$1,$A:$DP,111,FALSE)","v":{"$error":"#N/A"}},{"$f":"VLOOKUP($DR$1,$A:$DP,112,FALSE)","v":{"$error":"#N/A"}},{"$f":"VLOOKUP($DR$1,$A:$DP,113,FALSE)","v":{"$error":"#N/A"}},{"$f":"VLOOKUP($DR$1,$A:$DP,114,FALSE)","v":{"$error":"#N/A"}},{"$f":"VLOOKUP($DR$1,$A:$DP,115,FALSE)","v":{"$error":"#N/A"}},{"$f":"VLOOKUP($DR$1,$A:$DP,116,FALSE)","v":{"$error":"#N/A"}},{"$f":"VLOOKUP($DR$1,$A:$DP,117,FALSE)","v":{"$error":"#N/A"}},{"$f":"VLOOKUP($DR$1,$A:$DP,118,FALSE)","v":{"$error":"#N/A"}},{"$f":"VLOOKUP($DR$1,$A:$DP,119,FALSE)","v":{"$error":"#N/A"}},{"$f":"VLOOKUP($DR$1,$A:$DP,120,FALSE)","v":{"$error":"#N/A"}}]
[]
[]
[]
[]
[]
[]
[null,"EL CURSOR DEBERA ESTAR EN LA CELDA A2"]
[null,"EN LA HOJA DE CONSULTARCOTIZACION SE LLEVA A CABO LA BUSQUEDA DESDE ESTA PAGINA"]